{"text_format":"1","workbook":"xlsx","n_sheets":3,"sheets":["Sheet1","Sheet2","Sheet3"],"not_rendered":{"charts":0,"images":0,"macros":1,"external_links":0,"defined_names":3,"comments":0,"pivot_tables":0},"unopened":[],"bounds":{"document_bytes":16777216,"sheet_cells":100000,"rows_first":2000,"rows_last":500,"rows_between":2000,"halvings":0,"cell_chars":16384,"cell_head_chars":4096},"cells_cut":0,"cells_raw":0,"read":"whole","date_system":"1900"}

{"sheet":"Sheet1","index":0,"n_rows":410,"n_cols":9,"rows_kept":410,"cut":false,"hidden":false,"merged":[[0,0,0,2]]}
["Name"]
["Agent1","agent2","Agent1",null,null,null,null,null,"Without use advance filter"]
["Agent1","agent4","Agent1",null,null,null,null,"Need Requirement Unique name"]
["Agent1","agent5","agent7",null,null,null,null,"Agent1",{"$f":"IFERROR(IFERROR(INDEX(List1,MATCH(0,COUNTIF($I$3:I3,List1),0)),IFERROR(INDEX(List2,MATCH(0,COUNTIF($I$3:I3,List2),0)),INDEX(List3,MATCH(0,COUNTIF($I$3:I3,List3),0)))),\"\")","v":"Agent1"}]
["Agent1","agent2","agent7",null,null,null,null,"Agent2",{"$f":"IFERROR(IFERROR(INDEX(List1,MATCH(0,COUNTIF($I$3:I4,List1),0)),IFERROR(INDEX(List2,MATCH(0,COUNTIF($I$3:I4,List2),0)),INDEX(List3,MATCH(0,COUNTIF($I$3:I4,List3),0)))),\"\")","v":"Agent2"}]
["Agent2","agent2","agent7",null,null,null,null,"Agent3",{"$f":"IFERROR(IFERROR(INDEX(List1,MATCH(0,COUNTIF($I$3:I5,List1),0)),IFERROR(INDEX(List2,MATCH(0,COUNTIF($I$3:I5,List2),0)),INDEX(List3,MATCH(0,COUNTIF($I$3:I5,List3),0)))),\"\")","v":"agent3"}]
["Agent2","agent4","agent6",null,null,null,null,"Agent4",{"$f":"IFERROR(IFERROR(INDEX(List1,MATCH(0,COUNTIF($I$3:I6,List1),0)),IFERROR(INDEX(List2,MATCH(0,COUNTIF($I$3:I6,List2),0)),INDEX(List3,MATCH(0,COUNTIF($I$3:I6,List3),0)))),\"\")","v":"agent4"}]
["Agent2","agent4","agent6",null,null,null,null,"Agent5",{"$f":"IFERROR(IFERROR(INDEX(List1,MATCH(0,COUNTIF($I$3:I7,List1),0)),IFERROR(INDEX(List2,MATCH(0,COUNTIF($I$3:I7,List2),0)),INDEX(List3,MATCH(0,COUNTIF($I$3:I7,List3),0)))),\"\")","v":"agent5"}]
["agent3","agent5","agent6",null,null,null,null,"Agent6",{"$f":"IFERROR(IFERROR(INDEX(List1,MATCH(0,COUNTIF($I$3:I8,List1),0)),IFERROR(INDEX(List2,MATCH(0,COUNTIF($I$3:I8,List2),0)),INDEX(List3,MATCH(0,COUNTIF($I$3:I8,List3),0)))),\"\")","v":"agent6"}]
["agent3","agent5","agent3",null,null,null,null,"Agent7",{"$f":"IFERROR(IFERROR(INDEX(List1,MATCH(0,COUNTIF($I$3:I9,List1),0)),IFERROR(INDEX(List2,MATCH(0,COUNTIF($I$3:I9,List2),0)),INDEX(List3,MATCH(0,COUNTIF($I$3:I9,List3),0)))),\"\")","v":"agent7"}]
["agent3","agent6","Agent2",null,null,null,null,"Agent8",{"$f":"IFERROR(IFERROR(INDEX(List1,MATCH(0,COUNTIF($I$3:I10,List1),0)),IFERROR(INDEX(List2,MATCH(0,COUNTIF($I$3:I10,List2),0)),INDEX(List3,MATCH(0,COUNTIF($I$3:I10,List3),0)))),\"\")","v":"agent8"}]
["Agent1","agent7","Agent2",null,null,null,null,null,{"$f":"IFERROR(IFERROR(INDEX(List1,MATCH(0,COUNTIF($I$3:I11,List1),0)),IFERROR(INDEX(List2,MATCH(0,COUNTIF($I$3:I11,List2),0)),INDEX(List3,MATCH(0,COUNTIF($I$3:I11,List3),0)))),\"\")","v":"agent15"}]
["Agent1","agent8","Agent2",null,null,null,null,null,{"$f":"IFERROR(IFERROR(INDEX(List1,MATCH(0,COUNTIF($I$3:I12,List1),0)),IFERROR(INDEX(List2,MATCH(0,COUNTIF($I$3:I12,List2),0)),INDEX(List3,MATCH(0,COUNTIF($I$3:I12,List3),0)))),\"\")","v":""}]
["Agent1","agent8","Agent2",null,null,null,null,null,{"$f":"IFERROR(IFERROR(INDEX(List1,MATCH(0,COUNTIF($I$3:I13,List1),0)),IFERROR(INDEX(List2,MATCH(0,COUNTIF($I$3:I13,List2),0)),INDEX(List3,MATCH(0,COUNTIF($I$3:I13,List3),0)))),\"\")","v":""}]
["Agent2","agent8","agent15",null,null,null,null,null,{"$f":"IFERROR(IFERROR(INDEX(List1,MATCH(0,COUNTIF($I$3:I14,List1),0)),IFERROR(INDEX(List2,MATCH(0,COUNTIF($I$3:I14,List2),0)),INDEX(List3,MATCH(0,COUNTIF($I$3:I14,List3),0)))),\"\")","v":""}]
["Agent2","agent7","agent5",null,null,null,null,null,{"$f":"IFERROR(IFERROR(INDEX(List1,MATCH(0,COUNTIF($I$3:I15,List1),0)),IFERROR(INDEX(List2,MATCH(0,COUNTIF($I$3:I15,List2),0)),INDEX(List3,MATCH(0,COUNTIF($I$3:I15,List3),0)))),\"\")","v":""}]
[null,null,null,null,null,null,null,null,{"$f":"IFERROR(IFERROR(INDEX(List1,MATCH(0,COUNTIF($I$3:I16,List1),0)),IFERROR(INDEX(List2,MATCH(0,COUNTIF($I$3:I16,List2),0)),INDEX(List3,MATCH(0,COUNTIF($I$3:I16,List3),0)))),\"\")","v":""}]
[null,null,null,null,null,null,null,null,{"$f":"IFERROR(IFERROR(INDEX(List1,MATCH(0,COUNTIF($I$3:I17,List1),0)),INDEX(List2,MATCH(0,COUNTIF($I$3:I17,List2),0))),\"\")","v":""}]
[]
[]
[]
[]
[]
[]
[]
[]
[]
[]
[]
[]
[]
[]
[]
[]
[]
[]
[]
[]
[]
[]
[]
[]
[]
[]
[]
[]
[]
[]
[]
[]
[]
[]
[]
[]
[]
[]
[]
[]
[]
[]
[]
[]
[]
[]
[]
[]
[]
[]
[]
[]
[]
[]
[]
[]
[]
[]
[]
[]
[]
[]
[]
[]
[]
[]
[]
[]
[]
[]
[]
[]
[]
[]
[]
[]
[]
[]
[]
[]
[]
[]
[]
[]
[]
[]
[]
[]
[]
[]
[]
[]
[]
[]
[]
[]
[]
[]
[]
[]
[]
[]
[]
[]
[]
[]
[]
[]
[]
[]
[]
[]
[]
[]
[]
[]
[]
[]
[]
[]
[]
[]
[]
[]
[]
[]
[]
[]
[]
[]
[]
[]
[]
[]
[]
[]
[]
[]
[]
[]
[]
[]
[]
[]
[]
[]
[]
[]
[]
[]
[]
[]
[]
[]
[]
[]
[]
[]
[]
[]
[]
[]
[]
[]
[]
[]
[]
[]
[]
[]
[]
[]
[]
[]
[]
[]
[]
[]
[]
[]
[]
[]
[]
[]
[]
[]
[]
[]
[]
[]
[]
[]
[]
[]
[]
[]
[]
[]
[]
[]
[]
[]
[]
[]
[]
[]
[]
[]
[]
[]
[]
[]
[]
[]
[]
[]
[]
[]
[]
[]
[]
[]
[]
[]
[]
[]
[]
[]
[]
[]
[]
[]
[]
[]
[]
[]
[]
[]
[]
[]
[]
[]
[]
[]
[]
[]
[]
[]
[]
[]
[]
[]
[]
[]
[]
[]
[]
[]
[]
[]
[]
[]
[]
[]
[]
[]
[]
[]
[]
[]
[]
[]
[]
[]
[]
[]
[]
[]
[]
[]
[]
[]
[]
[]
[]
[]
[]
[]
[]
[]
[]
[]
[]
[]
[]
[]
[]
[]
[]
[]
[]
[]
[]
[]
[]
[]
[]
[]
[]
[]
[]
[]
[]
[]
[]
[]
[]
[]
[]
[]
[]
[]
[]
[]
[]
[]
[]
[]
[]
[]
[]
[]
[]
[]
[]
[]
[]
[]
[]
[]
[]
[]
[]
[]
[]
[]
[]
[]
[]
[]
[]
[]
[]
[]
[]
[]
[]
[]
[]
[]
[]
[]
[]
[]
[]
[]
[]
[]
[]
[]
[]
[]
[]
[]
[]
[]
[]
[]
[]
[]
[]
[]
[]
[]
[]
[]
[]
[]
[]
[]
[]
[null,null,null,null,null,"Agent1"]

{"sheet":"Sheet2","index":1,"n_rows":0,"n_cols":0,"rows_kept":0,"cut":false,"hidden":false,"merged":[]}

{"sheet":"Sheet3","index":2,"n_rows":0,"n_cols":0,"rows_kept":0,"cut":false,"hidden":false,"merged":[]}