{"text_format":"1","workbook":"xlsx","n_sheets":2,"sheets":["Sheet1","INVOICE DATA"],"not_rendered":{"charts":0,"images":0,"macros":1,"external_links":0,"defined_names":0,"comments":0,"pivot_tables":0},"unopened":[],"bounds":{"document_bytes":16777216,"sheet_cells":100000,"rows_first":2000,"rows_last":500,"rows_between":2000,"halvings":0,"cell_chars":16384,"cell_head_chars":4096},"cells_cut":0,"cells_raw":0,"read":"whole","date_system":"1900"}

{"sheet":"Sheet1","index":0,"n_rows":41,"n_cols":14,"rows_kept":41,"cut":false,"hidden":false,"merged":[[26,0,27,3],[26,4,27,15],[18,6,19,6],[18,7,19,7],[5,6,11,12],[21,0,22,5],[21,6,22,6],[21,7,22,7],[21,8,22,8],[21,9,22,10],[21,11,22,12],[16,6,17,7],[18,0,19,5],[15,0,16,5],[21,13,22,15],[18,8,19,8],[40,0,40,15],[31,11,34,15],[28,0,28,2],[28,3,28,4],[28,5,28,6],[35,11,39,15],[29,7,30,15],[35,0,39,4],[35,5,39,10],[29,0,30,2],[29,3,30,4],[29,5,30,6],[18,9,19,10],[18,11,19,12],[18,13,19,15],[14,8,15,12],[16,8,17,12],[17,0,17,1],[17,2,17,5],[0,13,1,15],[2,13,3,15],[13,0,14,5],[4,13,14,15],[0,6,3,10],[0,11,1,12],[2,11,3,12],[9,0,12,5],[1,2,7,5],[12,6,13,7],[12,8,13,12],[14,6,15,7]]}
[null,null,null,null,null,null,"TAX INVOICE",null,null,null,null,"INVOICE NO:",null,"MP-RWA-13-14-010"]
[]
[null,null,null,null,null,null,null,null,null,null,null,"INVOICE DATE:",null,{"$f":"INDEX('INVOICE DATA'!$A:$CD,MATCH($N$1,'INVOICE DATA'!$C:$C,0),MATCH(L3,'INVOICE DATA'!$1:$1,0))","v":"2014-02-05"}]
[]
[null,null,null,null,null,null," SOLD TO:",null,null,null,null,null,null,"\"IN RESPECT OF THE GOODS COVERED IN THIS INVOICE NO CREDIT OF THE ADDITIONAL DUTY OF CUSTOMS LEVIED UNDER SUB SECTION (5) OF SECTIONS3 OF THE CUSTOMS TARIFF ACT. 1975 SHALL BE ADMISSIBLE\""]
[null,null,null,null,null,null,{"$f":"INDEX('INVOICE DATA'!$A:$CD,MATCH($N$1,'INVOICE DATA'!$C:$C,0),MATCH(G5,'INVOICE DATA'!$1:$1,0))","v":"M/S UPENDRA DIWEDI, J.P. PLANT, NIGRI SITE, SIDHI"}]
[]
[]
["DELIVERY FROM GODOWN AT:"]
[{"$f":"INDEX('INVOICE DATA'!$A:$CD,MATCH($N$1,'INVOICE DATA'!$C:$C,0),MATCH(A9,'INVOICE DATA'!$1:$1,0))","v":"WARD NO: 4, BANSAL WAREHOUSE, RANIBAGH, CHORAHTA, REWA - 486001, MADHYA PRADESH"}]
[]
[]
[null,null,null,null,null,null,"PURCHASER TIN:",null,{"$f":"INDEX('INVOICE DATA'!$A:$CD,MATCH($N$1,'INVOICE DATA'!$C:$C,0),MATCH(G13,'INVOICE DATA'!$1:$1,0))","v":0}]
["TIN NO: 23799071453 \nCST NO: 23799071453 "]
[null,null,null,null,null,null,"TRANSPORTER NAME",null,{"$f":"INDEX('INVOICE DATA'!$A:$CD,MATCH($N$1,'INVOICE DATA'!$C:$C,0),MATCH(G15,'INVOICE DATA'!$1:$1,0))","v":"ATUL TRANSPORT"}]
["MODEL OF DELIVERY : TRUCK"]
[null,null,null,null,null,null,"LR NO:",null,{"$f":"INDEX('INVOICE DATA'!$A:$CD,MATCH($N$1,'INVOICE DATA'!$C:$C,0),MATCH(G17,'INVOICE DATA'!$1:$1,0))","v":0}]
["TRUCK NO:",null,{"$f":"INDEX('INVOICE DATA'!$A:$CD,MATCH($N$1,'INVOICE DATA'!$C:$C,0),MATCH(A18,'INVOICE DATA'!$1:$1,0))","v":"MP-17-L-0152"}]
["    PRODUCT NAME",null,null,null,null,null,"RATE OF TAX","UNIT PRICE PER BARREL","QUANTITY IN BARREL","NET VALUE IN RS.",null,"TAX AMOUNT",null,"TOTAL INVOICE VALUE"]
[]
[]
[{"$f":"INDEX('INVOICE DATA'!$A:$CD,MATCH($N$1,'INVOICE DATA'!$C:$C,0),MATCH(A19,'INVOICE DATA'!$1:$1,0))","v":"BITUMEN - GRADE 60/70"},null,null,null,null,null,{"$f":"INDEX('INVOICE DATA'!$A:$CD,MATCH($N$1,'INVOICE DATA'!$C:$C,0),MATCH(G19,'INVOICE DATA'!$1:$1,0))","v":0},{"$f":"INDEX('INVOICE DATA'!$A:$CD,MATCH($N$1,'INVOICE DATA'!$C:$C,0),MATCH(H19,'INVOICE DATA'!$1:$1,0))","v":10026.67},{"$f":"INDEX('INVOICE DATA'!$A:$CD,MATCH($N$1,'INVOICE DATA'!$C:$C,0),MATCH(I19,'INVOICE DATA'!$1:$1,0))","v":4},{"$f":"INDEX('INVOICE DATA'!$A:$CD,MATCH($N$1,'INVOICE DATA'!$C:$C,0),MATCH(J19,'INVOICE DATA'!$1:$1,0))","v":40106.68},null,{"$f":"INDEX('INVOICE DATA'!$A:$CD,MATCH($N$1,'INVOICE DATA'!$C:$C,0),MATCH(L19,'INVOICE DATA'!$1:$1,0))","v":2005.3340000000001},null,{"$f":"INDEX('INVOICE DATA'!$A:$CD,MATCH($N$1,'INVOICE DATA'!$C:$C,0),MATCH(N19,'INVOICE DATA'!$1:$1,0))","v":42112.014000000003}]
[]
[]
[]
[]
["GRAND TOTAL IN WORDS:",null,null,null,{"$f":"SPELLNUMBER(N22)","v":"Rupees Fourty Two Thousand One Hundred and Twelve Paise One Only "}]
[]
["CASH / CHEQUE / DD NO.",null,null,"DATE",null,"AMOUNT"]
[{"$f":"INDEX('INVOICE DATA'!$A:$CD,MATCH($N$1,'INVOICE DATA'!$C:$C,0),MATCH(A29,'INVOICE DATA'!$1:$1,0))","v":"NEFT"},null,null,{"$f":"INDEX('INVOICE DATA'!$A:$CD,MATCH($N$1,'INVOICE DATA'!$C:$C,0),MATCH(D29,'INVOICE DATA'!$1:$1,0))","v":"00:00:00"},null,{"$f":"INDEX('INVOICE DATA'!$A:$CD,MATCH($N$1,'INVOICE DATA'!$C:$C,0),MATCH(F29,'INVOICE DATA'!$1:$1,0))","v":52640},null,"ALL PAYMENTS SHOULD BE IN FAVOUR OF: VARDEEP TRADE LINKS PVT. LTD."]
[]
["AUTHORISED BY:",null,null,null,null,"RELEASED BY:",null,null,null,null,null,"GOODS RECEIVED IN GOOD CONDITION BY:"]
[]
[]
[]
[]
[]
[]
[]
[]
["THIS IS COMPUTER GENERATED DOCUMENT HENCE NO STAMP AND SIGNATURE REQUIRED."]

{"sheet":"INVOICE DATA","index":1,"n_rows":2,"n_cols":21,"rows_kept":2,"cut":false,"hidden":false,"merged":[]}
["S NO","INVOICE DATE:","INVOICE NO:","DELIVERY FROM GODOWN AT:"," SOLD TO:","PURCHASER TIN:","TRUCK NO:","TRANSPORTER NAME","LR NO:","    PRODUCT NAME","RATE OF TAX","UNIT PRICE PER BARREL","QUANTITY IN BARREL","NET VALUE IN RS.","TAX AMOUNT","TOTAL INVOICE VALUE","CASH / CHEQUE / DD NO.","DATE","AMOUNT","ADVANCE AMOUNT","BALANCE AMOUNT"]
[1,"2014-02-05","MP-RWA-13-14-010","WARD NO: 4, BANSAL WAREHOUSE, RANIBAGH, CHORAHTA, REWA - 486001, MADHYA PRADESH","M/S UPENDRA DIWEDI, J.P. PLANT, NIGRI SITE, SIDHI",0,"MP-17-L-0152","ATUL TRANSPORT",0,"BITUMEN - GRADE 60/70",null,10026.67,4,40106.68,2005.3340000000001,42112.014000000003,"NEFT",null,52640,0,10528]