{"text_format":"1","workbook":"xlsx","n_sheets":3,"sheets":["Hoja1","Hoja2","Hoja3"],"not_rendered":{"charts":0,"images":0,"macros":0,"external_links":1,"defined_names":0,"comments":0,"pivot_tables":0},"unopened":[],"bounds":{"document_bytes":16777216,"sheet_cells":100000,"rows_first":2000,"rows_last":500,"rows_between":2000,"halvings":0,"cell_chars":16384,"cell_head_chars":4096},"cells_cut":0,"cells_raw":0,"read":"whole","date_system":"1900"}

{"sheet":"Hoja1","index":0,"n_rows":26,"n_cols":12,"rows_kept":26,"cut":false,"hidden":false,"merged":[]}
["ok","Column2","Column3","Column4","Column5","Column6","Column7","Column8","Column9","Column10","Column11","Column12"]
["A-1",{"$f":"IFERROR(VLOOKUP($A2,[1]a!$A$1:$L$11,2,0),\"\")","v":"A"},{"$f":"IFERROR(VLOOKUP($A2,[1]a!$A$1:$L$11,3,0),\"\")","v":"IT"},{"$f":"IFERROR(VLOOKUP($A2,[1]a!$A$1:$L$11,4,0),\"\")","v":"XX"},{"$f":"IFERROR(VLOOKUP($A2,[1]a!$A$1:$L$11,5,0),\"\")","v":"XX"},{"$f":"IFERROR(VLOOKUP($A2,[1]a!$A$1:$L$11,6,0),\"\")","v":"XX"},{"$f":"IFERROR(VLOOKUP($A2,[1]a!$A$1:$L$11,7,0),\"\")","v":"XX"},{"$f":"IFERROR(VLOOKUP($A2,[1]a!$A$1:$L$11,8,0),\"\")","v":"XX"},{"$f":"IFERROR(VLOOKUP($A2,[1]a!$A$1:$L$11,9,0),\"\")","v":"XX"},{"$f":"IFERROR(VLOOKUP($A2,[1]a!$A$1:$L$11,10,0),\"\")","v":"XX"},{"$f":"IFERROR(VLOOKUP($A2,[1]a!$A$1:$L$11,4,0),\"\")","v":"XX"},{"$f":"IFERROR(VLOOKUP($A2,[1]a!$A$1:$L$12,4,0),\"\")","v":"XX"}]
["A-2",{"$f":"IFERROR(VLOOKUP($A3,[1]a!$A$1:$L$11,2,0),\"\")","v":""},{"$f":"IFERROR(VLOOKUP($A3,[1]a!$A$1:$L$11,3,0),\"\")","v":""},{"$f":"IFERROR(VLOOKUP($A3,[1]a!$A$1:$L$11,4,0),\"\")","v":""},{"$f":"IFERROR(VLOOKUP($A3,[1]a!$A$1:$L$11,5,0),\"\")","v":""},{"$f":"IFERROR(VLOOKUP($A3,[1]a!$A$1:$L$11,6,0),\"\")","v":""},{"$f":"IFERROR(VLOOKUP($A3,[1]a!$A$1:$L$11,7,0),\"\")","v":""},{"$f":"IFERROR(VLOOKUP($A3,[1]a!$A$1:$L$11,8,0),\"\")","v":""},{"$f":"IFERROR(VLOOKUP($A3,[1]a!$A$1:$L$11,9,0),\"\")","v":""},{"$f":"IFERROR(VLOOKUP($A3,[1]a!$A$1:$L$11,10,0),\"\")","v":""},{"$f":"IFERROR(VLOOKUP($A3,[1]a!$A$1:$L$11,4,0),\"\")","v":""},{"$f":"IFERROR(VLOOKUP($A3,[1]a!$A$1:$L$12,4,0),\"\")","v":""}]
["A-3",{"$f":"IFERROR(VLOOKUP($A4,[1]a!$A$1:$L$11,2,0),\"\")","v":""},{"$f":"IFERROR(VLOOKUP($A4,[1]a!$A$1:$L$11,3,0),\"\")","v":""},{"$f":"IFERROR(VLOOKUP($A4,[1]a!$A$1:$L$11,4,0),\"\")","v":""},{"$f":"IFERROR(VLOOKUP($A4,[1]a!$A$1:$L$11,5,0),\"\")","v":""},{"$f":"IFERROR(VLOOKUP($A4,[1]a!$A$1:$L$11,6,0),\"\")","v":""},{"$f":"IFERROR(VLOOKUP($A4,[1]a!$A$1:$L$11,7,0),\"\")","v":""},{"$f":"IFERROR(VLOOKUP($A4,[1]a!$A$1:$L$11,8,0),\"\")","v":""},{"$f":"IFERROR(VLOOKUP($A4,[1]a!$A$1:$L$11,9,0),\"\")","v":""},{"$f":"IFERROR(VLOOKUP($A4,[1]a!$A$1:$L$11,10,0),\"\")","v":""},{"$f":"IFERROR(VLOOKUP($A4,[1]a!$A$1:$L$11,4,0),\"\")","v":""},{"$f":"IFERROR(VLOOKUP($A4,[1]a!$A$1:$L$12,4,0),\"\")","v":""}]
["A-4",{"$f":"IFERROR(VLOOKUP($A5,[1]a!$A$1:$L$11,2,0),\"\")","v":""},{"$f":"IFERROR(VLOOKUP($A5,[1]a!$A$1:$L$11,3,0),\"\")","v":""},{"$f":"IFERROR(VLOOKUP($A5,[1]a!$A$1:$L$11,4,0),\"\")","v":""},{"$f":"IFERROR(VLOOKUP($A5,[1]a!$A$1:$L$11,5,0),\"\")","v":""},{"$f":"IFERROR(VLOOKUP($A5,[1]a!$A$1:$L$11,6,0),\"\")","v":""},{"$f":"IFERROR(VLOOKUP($A5,[1]a!$A$1:$L$11,7,0),\"\")","v":""},{"$f":"IFERROR(VLOOKUP($A5,[1]a!$A$1:$L$11,8,0),\"\")","v":""},{"$f":"IFERROR(VLOOKUP($A5,[1]a!$A$1:$L$11,9,0),\"\")","v":""},{"$f":"IFERROR(VLOOKUP($A5,[1]a!$A$1:$L$11,10,0),\"\")","v":""},{"$f":"IFERROR(VLOOKUP($A5,[1]a!$A$1:$L$11,4,0),\"\")","v":""},{"$f":"IFERROR(VLOOKUP($A5,[1]a!$A$1:$L$12,4,0),\"\")","v":""}]
["b-1",{"$f":"IFERROR(VLOOKUP($A6,[1]B!$A$1:$L$11,2,0),\"\")","v":"b"},{"$f":"IFERROR(VLOOKUP($A6,[1]B!$A$1:$L$11,3,0),\"\")","v":"IT"},{"$f":"IFERROR(VLOOKUP($A6,[1]B!$A$1:$L$11,4,0),\"\")","v":"XX"},{"$f":"IFERROR(VLOOKUP($A6,[1]B!$A$1:$L$11,5,0),\"\")","v":"XX"},{"$f":"IFERROR(VLOOKUP($A6,[1]B!$A$1:$L$11,6,0),\"\")","v":"XX"},{"$f":"IFERROR(VLOOKUP($A6,[1]B!$A$1:$L$11,7,0),\"\")","v":"XX"},{"$f":"IFERROR(VLOOKUP($A6,[1]B!$A$1:$L$11,8,0),\"\")","v":"XX"},{"$f":"IFERROR(VLOOKUP($A6,[1]B!$A$1:$L$11,9,0),\"\")","v":"XX"},{"$f":"IFERROR(VLOOKUP($A6,[1]B!$A$1:$L$11,10,0),\"\")","v":"XX"},{"$f":"IFERROR(VLOOKUP($A6,[1]B!$A$1:$L$11,4,0),\"\")","v":"XX"},{"$f":"IFERROR(VLOOKUP($A6,[1]B!$A$1:$L$12,4,0),\"\")","v":"XX"}]
["b-2",{"$f":"IFERROR(VLOOKUP($A7,[1]B!$A$1:$L$11,2,0),\"\")","v":"bb"},{"$f":"IFERROR(VLOOKUP($A7,[1]B!$A$1:$L$11,3,0),\"\")","v":"IT"},{"$f":"IFERROR(VLOOKUP($A7,[1]B!$A$1:$L$11,4,0),\"\")","v":"XX"},{"$f":"IFERROR(VLOOKUP($A7,[1]B!$A$1:$L$11,5,0),\"\")","v":"XX"},{"$f":"IFERROR(VLOOKUP($A7,[1]B!$A$1:$L$11,6,0),\"\")","v":"XX"},{"$f":"IFERROR(VLOOKUP($A7,[1]B!$A$1:$L$11,7,0),\"\")","v":"XX"},{"$f":"IFERROR(VLOOKUP($A7,[1]B!$A$1:$L$11,8,0),\"\")","v":"XX"},{"$f":"IFERROR(VLOOKUP($A7,[1]B!$A$1:$L$11,9,0),\"\")","v":"XX"},{"$f":"IFERROR(VLOOKUP($A7,[1]B!$A$1:$L$11,10,0),\"\")","v":"XX"},{"$f":"IFERROR(VLOOKUP($A7,[1]B!$A$1:$L$11,4,0),\"\")","v":"XX"},{"$f":"IFERROR(VLOOKUP($A7,[1]B!$A$1:$L$12,4,0),\"\")","v":"XX"}]
["b-3",{"$f":"IFERROR(VLOOKUP($A8,[1]B!$A$1:$L$11,2,0),\"\")","v":""},{"$f":"IFERROR(VLOOKUP($A8,[1]B!$A$1:$L$11,3,0),\"\")","v":""},{"$f":"IFERROR(VLOOKUP($A8,[1]B!$A$1:$L$11,4,0),\"\")","v":""},{"$f":"IFERROR(VLOOKUP($A8,[1]B!$A$1:$L$11,5,0),\"\")","v":""},{"$f":"IFERROR(VLOOKUP($A8,[1]B!$A$1:$L$11,6,0),\"\")","v":""},{"$f":"IFERROR(VLOOKUP($A8,[1]B!$A$1:$L$11,7,0),\"\")","v":""},{"$f":"IFERROR(VLOOKUP($A8,[1]B!$A$1:$L$11,8,0),\"\")","v":""},{"$f":"IFERROR(VLOOKUP($A8,[1]B!$A$1:$L$11,9,0),\"\")","v":""},{"$f":"IFERROR(VLOOKUP($A8,[1]B!$A$1:$L$11,10,0),\"\")","v":""},{"$f":"IFERROR(VLOOKUP($A8,[1]B!$A$1:$L$11,4,0),\"\")","v":""},{"$f":"IFERROR(VLOOKUP($A8,[1]B!$A$1:$L$12,4,0),\"\")","v":""}]
["b-4",{"$f":"IFERROR(VLOOKUP($A9,[1]B!$A$1:$L$11,2,0),\"\")","v":""},{"$f":"IFERROR(VLOOKUP($A9,[1]B!$A$1:$L$11,3,0),\"\")","v":""},{"$f":"IFERROR(VLOOKUP($A9,[1]B!$A$1:$L$11,4,0),\"\")","v":""},{"$f":"IFERROR(VLOOKUP($A9,[1]B!$A$1:$L$11,5,0),\"\")","v":""},{"$f":"IFERROR(VLOOKUP($A9,[1]B!$A$1:$L$11,6,0),\"\")","v":""},{"$f":"IFERROR(VLOOKUP($A9,[1]B!$A$1:$L$11,7,0),\"\")","v":""},{"$f":"IFERROR(VLOOKUP($A9,[1]B!$A$1:$L$11,8,0),\"\")","v":""},{"$f":"IFERROR(VLOOKUP($A9,[1]B!$A$1:$L$11,9,0),\"\")","v":""},{"$f":"IFERROR(VLOOKUP($A9,[1]B!$A$1:$L$11,10,0),\"\")","v":""},{"$f":"IFERROR(VLOOKUP($A9,[1]B!$A$1:$L$11,4,0),\"\")","v":""},{"$f":"IFERROR(VLOOKUP($A9,[1]B!$A$1:$L$12,4,0),\"\")","v":""}]
["c-1",{"$f":"IFERROR(VLOOKUP($A10,[1]C!$A$1:$L$11,2,0),\"\")","v":"C"},{"$f":"IFERROR(VLOOKUP($A10,[1]C!$A$1:$L$11,3,0),\"\")","v":"IT"},{"$f":"IFERROR(VLOOKUP($A10,[1]C!$A$1:$L$11,4,0),\"\")","v":"XX"},{"$f":"IFERROR(VLOOKUP($A10,[1]C!$A$1:$L$11,5,0),\"\")","v":"XX"},{"$f":"IFERROR(VLOOKUP($A10,[1]C!$A$1:$L$11,6,0),\"\")","v":"XX"},{"$f":"IFERROR(VLOOKUP($A10,[1]C!$A$1:$L$11,7,0),\"\")","v":"XX"},{"$f":"IFERROR(VLOOKUP($A10,[1]C!$A$1:$L$11,8,0),\"\")","v":"XX"},{"$f":"IFERROR(VLOOKUP($A10,[1]C!$A$1:$L$11,9,0),\"\")","v":"XX"},{"$f":"IFERROR(VLOOKUP($A10,[1]C!$A$1:$L$11,10,0),\"\")","v":"XX"},{"$f":"IFERROR(VLOOKUP($A10,[1]C!$A$1:$L$11,4,0),\"\")","v":"XX"},{"$f":"IFERROR(VLOOKUP($A10,[1]C!$A$1:$L$12,4,0),\"\")","v":"XX"}]
["c-2",{"$f":"IFERROR(VLOOKUP($A11,[1]C!$A$1:$L$11,2,0),\"\")","v":""},{"$f":"IFERROR(VLOOKUP($A11,[1]C!$A$1:$L$11,3,0),\"\")","v":""},{"$f":"IFERROR(VLOOKUP($A11,[1]C!$A$1:$L$11,4,0),\"\")","v":""},{"$f":"IFERROR(VLOOKUP($A11,[1]C!$A$1:$L$11,5,0),\"\")","v":""},{"$f":"IFERROR(VLOOKUP($A11,[1]C!$A$1:$L$11,6,0),\"\")","v":""},{"$f":"IFERROR(VLOOKUP($A11,[1]C!$A$1:$L$11,7,0),\"\")","v":""},{"$f":"IFERROR(VLOOKUP($A11,[1]C!$A$1:$L$11,8,0),\"\")","v":""},{"$f":"IFERROR(VLOOKUP($A11,[1]C!$A$1:$L$11,9,0),\"\")","v":""},{"$f":"IFERROR(VLOOKUP($A11,[1]C!$A$1:$L$11,10,0),\"\")","v":""},{"$f":"IFERROR(VLOOKUP($A11,[1]C!$A$1:$L$11,4,0),\"\")","v":""},{"$f":"IFERROR(VLOOKUP($A11,[1]C!$A$1:$L$12,4,0),\"\")","v":""}]
["c-3",{"$f":"IFERROR(VLOOKUP($A12,[1]C!$A$1:$L$11,2,0),\"\")","v":""},{"$f":"IFERROR(VLOOKUP($A12,[1]C!$A$1:$L$11,3,0),\"\")","v":""},{"$f":"IFERROR(VLOOKUP($A12,[1]C!$A$1:$L$11,4,0),\"\")","v":""},{"$f":"IFERROR(VLOOKUP($A12,[1]C!$A$1:$L$11,5,0),\"\")","v":""},{"$f":"IFERROR(VLOOKUP($A12,[1]C!$A$1:$L$11,6,0),\"\")","v":""},{"$f":"IFERROR(VLOOKUP($A12,[1]C!$A$1:$L$11,7,0),\"\")","v":""},{"$f":"IFERROR(VLOOKUP($A12,[1]C!$A$1:$L$11,8,0),\"\")","v":""},{"$f":"IFERROR(VLOOKUP($A12,[1]C!$A$1:$L$11,9,0),\"\")","v":""},{"$f":"IFERROR(VLOOKUP($A12,[1]C!$A$1:$L$11,10,0),\"\")","v":""},{"$f":"IFERROR(VLOOKUP($A12,[1]C!$A$1:$L$11,4,0),\"\")","v":""},{"$f":"IFERROR(VLOOKUP($A12,[1]C!$A$1:$L$12,4,0),\"\")","v":""}]
["c-4",{"$f":"IFERROR(VLOOKUP($A13,[1]C!$A$1:$L$11,2,0),\"\")","v":""},{"$f":"IFERROR(VLOOKUP($A13,[1]C!$A$1:$L$11,3,0),\"\")","v":""},{"$f":"IFERROR(VLOOKUP($A13,[1]C!$A$1:$L$11,4,0),\"\")","v":""},{"$f":"IFERROR(VLOOKUP($A13,[1]C!$A$1:$L$11,5,0),\"\")","v":""},{"$f":"IFERROR(VLOOKUP($A13,[1]C!$A$1:$L$11,6,0),\"\")","v":""},{"$f":"IFERROR(VLOOKUP($A13,[1]C!$A$1:$L$11,7,0),\"\")","v":""},{"$f":"IFERROR(VLOOKUP($A13,[1]C!$A$1:$L$11,8,0),\"\")","v":""},{"$f":"IFERROR(VLOOKUP($A13,[1]C!$A$1:$L$11,9,0),\"\")","v":""},{"$f":"IFERROR(VLOOKUP($A13,[1]C!$A$1:$L$11,10,0),\"\")","v":""},{"$f":"IFERROR(VLOOKUP($A13,[1]C!$A$1:$L$11,4,0),\"\")","v":""},{"$f":"IFERROR(VLOOKUP($A13,[1]C!$A$1:$L$12,4,0),\"\")","v":""}]
["c-5",{"$f":"IFERROR(VLOOKUP($A14,[1]C!$A$1:$L$11,2,0),\"\")","v":""},{"$f":"IFERROR(VLOOKUP($A14,[1]C!$A$1:$L$11,3,0),\"\")","v":""},{"$f":"IFERROR(VLOOKUP($A14,[1]C!$A$1:$L$11,4,0),\"\")","v":""},{"$f":"IFERROR(VLOOKUP($A14,[1]C!$A$1:$L$11,5,0),\"\")","v":""},{"$f":"IFERROR(VLOOKUP($A14,[1]C!$A$1:$L$11,6,0),\"\")","v":""},{"$f":"IFERROR(VLOOKUP($A14,[1]C!$A$1:$L$11,7,0),\"\")","v":""},{"$f":"IFERROR(VLOOKUP($A14,[1]C!$A$1:$L$11,8,0),\"\")","v":""},{"$f":"IFERROR(VLOOKUP($A14,[1]C!$A$1:$L$11,9,0),\"\")","v":""},{"$f":"IFERROR(VLOOKUP($A14,[1]C!$A$1:$L$11,10,0),\"\")","v":""},{"$f":"IFERROR(VLOOKUP($A14,[1]C!$A$1:$L$11,4,0),\"\")","v":""},{"$f":"IFERROR(VLOOKUP($A14,[1]C!$A$1:$L$12,4,0),\"\")","v":""}]
["c-6",{"$f":"IFERROR(VLOOKUP($A15,[1]C!$A$1:$L$11,2,0),\"\")","v":""},{"$f":"IFERROR(VLOOKUP($A15,[1]C!$A$1:$L$11,3,0),\"\")","v":""},{"$f":"IFERROR(VLOOKUP($A15,[1]C!$A$1:$L$11,4,0),\"\")","v":""},{"$f":"IFERROR(VLOOKUP($A15,[1]C!$A$1:$L$11,5,0),\"\")","v":""},{"$f":"IFERROR(VLOOKUP($A15,[1]C!$A$1:$L$11,6,0),\"\")","v":""},{"$f":"IFERROR(VLOOKUP($A15,[1]C!$A$1:$L$11,7,0),\"\")","v":""},{"$f":"IFERROR(VLOOKUP($A15,[1]C!$A$1:$L$11,8,0),\"\")","v":""},{"$f":"IFERROR(VLOOKUP($A15,[1]C!$A$1:$L$11,9,0),\"\")","v":""},{"$f":"IFERROR(VLOOKUP($A15,[1]C!$A$1:$L$11,10,0),\"\")","v":""},{"$f":"IFERROR(VLOOKUP($A15,[1]C!$A$1:$L$11,4,0),\"\")","v":""},{"$f":"IFERROR(VLOOKUP($A15,[1]C!$A$1:$L$12,4,0),\"\")","v":""}]
["c-7",{"$f":"IFERROR(VLOOKUP($A16,[1]C!$A$1:$L$11,2,0),\"\")","v":""},{"$f":"IFERROR(VLOOKUP($A16,[1]C!$A$1:$L$11,3,0),\"\")","v":""},{"$f":"IFERROR(VLOOKUP($A16,[1]C!$A$1:$L$11,4,0),\"\")","v":""},{"$f":"IFERROR(VLOOKUP($A16,[1]C!$A$1:$L$11,5,0),\"\")","v":""},{"$f":"IFERROR(VLOOKUP($A16,[1]C!$A$1:$L$11,6,0),\"\")","v":""},{"$f":"IFERROR(VLOOKUP($A16,[1]C!$A$1:$L$11,7,0),\"\")","v":""},{"$f":"IFERROR(VLOOKUP($A16,[1]C!$A$1:$L$11,8,0),\"\")","v":""},{"$f":"IFERROR(VLOOKUP($A16,[1]C!$A$1:$L$11,9,0),\"\")","v":""},{"$f":"IFERROR(VLOOKUP($A16,[1]C!$A$1:$L$11,10,0),\"\")","v":""},{"$f":"IFERROR(VLOOKUP($A16,[1]C!$A$1:$L$11,4,0),\"\")","v":""},{"$f":"IFERROR(VLOOKUP($A16,[1]C!$A$1:$L$12,4,0),\"\")","v":""}]
["d-1",{"$f":"IFERROR(VLOOKUP($A17,[1]d!$A$1:$L$11,2,0),\"\")","v":"D"},{"$f":"IFERROR(VLOOKUP($A17,[1]d!$A$1:$L$11,3,0),\"\")","v":"IT"},{"$f":"IFERROR(VLOOKUP($A17,[1]d!$A$1:$L$11,4,0),\"\")","v":"XX"},{"$f":"IFERROR(VLOOKUP($A17,[1]d!$A$1:$L$11,5,0),\"\")","v":"XX"},{"$f":"IFERROR(VLOOKUP($A17,[1]d!$A$1:$L$11,6,0),\"\")","v":"XX"},{"$f":"IFERROR(VLOOKUP($A17,[1]d!$A$1:$L$11,7,0),\"\")","v":"XX"},{"$f":"IFERROR(VLOOKUP($A17,[1]d!$A$1:$L$11,8,0),\"\")","v":"XX"},{"$f":"IFERROR(VLOOKUP($A17,[1]d!$A$1:$L$11,9,0),\"\")","v":"XX"},{"$f":"IFERROR(VLOOKUP($A17,[1]d!$A$1:$L$11,10,0),\"\")","v":"XX"},{"$f":"IFERROR(VLOOKUP($A17,[1]d!$A$1:$L$11,4,0),\"\")","v":"XX"},{"$f":"IFERROR(VLOOKUP($A17,[1]d!$A$1:$L$12,4,0),\"\")","v":"XX"}]
["d-2",{"$f":"IFERROR(VLOOKUP($A18,[1]d!$A$1:$L$11,2,0),\"\")","v":""},{"$f":"IFERROR(VLOOKUP($A18,[1]d!$A$1:$L$11,3,0),\"\")","v":""},{"$f":"IFERROR(VLOOKUP($A18,[1]d!$A$1:$L$11,4,0),\"\")","v":""},{"$f":"IFERROR(VLOOKUP($A18,[1]d!$A$1:$L$11,5,0),\"\")","v":""},{"$f":"IFERROR(VLOOKUP($A18,[1]d!$A$1:$L$11,6,0),\"\")","v":""},{"$f":"IFERROR(VLOOKUP($A18,[1]d!$A$1:$L$11,7,0),\"\")","v":""},{"$f":"IFERROR(VLOOKUP($A18,[1]d!$A$1:$L$11,8,0),\"\")","v":""},{"$f":"IFERROR(VLOOKUP($A18,[1]d!$A$1:$L$11,9,0),\"\")","v":""},{"$f":"IFERROR(VLOOKUP($A18,[1]d!$A$1:$L$11,10,0),\"\")","v":""},{"$f":"IFERROR(VLOOKUP($A18,[1]d!$A$1:$L$11,4,0),\"\")","v":""},{"$f":"IFERROR(VLOOKUP($A18,[1]d!$A$1:$L$12,4,0),\"\")","v":""}]
["d-3",{"$f":"IFERROR(VLOOKUP($A19,[1]d!$A$1:$L$11,2,0),\"\")","v":""},{"$f":"IFERROR(VLOOKUP($A19,[1]d!$A$1:$L$11,3,0),\"\")","v":""},{"$f":"IFERROR(VLOOKUP($A19,[1]d!$A$1:$L$11,4,0),\"\")","v":""},{"$f":"IFERROR(VLOOKUP($A19,[1]d!$A$1:$L$11,5,0),\"\")","v":""},{"$f":"IFERROR(VLOOKUP($A19,[1]d!$A$1:$L$11,6,0),\"\")","v":""},{"$f":"IFERROR(VLOOKUP($A19,[1]d!$A$1:$L$11,7,0),\"\")","v":""},{"$f":"IFERROR(VLOOKUP($A19,[1]d!$A$1:$L$11,8,0),\"\")","v":""},{"$f":"IFERROR(VLOOKUP($A19,[1]d!$A$1:$L$11,9,0),\"\")","v":""},{"$f":"IFERROR(VLOOKUP($A19,[1]d!$A$1:$L$11,10,0),\"\")","v":""},{"$f":"IFERROR(VLOOKUP($A19,[1]d!$A$1:$L$11,4,0),\"\")","v":""},{"$f":"IFERROR(VLOOKUP($A19,[1]d!$A$1:$L$12,4,0),\"\")","v":""}]
["d-4",{"$f":"IFERROR(VLOOKUP($A20,[1]d!$A$1:$L$11,2,0),\"\")","v":""},{"$f":"IFERROR(VLOOKUP($A20,[1]d!$A$1:$L$11,3,0),\"\")","v":""},{"$f":"IFERROR(VLOOKUP($A20,[1]d!$A$1:$L$11,4,0),\"\")","v":""},{"$f":"IFERROR(VLOOKUP($A20,[1]d!$A$1:$L$11,5,0),\"\")","v":""},{"$f":"IFERROR(VLOOKUP($A20,[1]d!$A$1:$L$11,6,0),\"\")","v":""},{"$f":"IFERROR(VLOOKUP($A20,[1]d!$A$1:$L$11,7,0),\"\")","v":""},{"$f":"IFERROR(VLOOKUP($A20,[1]d!$A$1:$L$11,8,0),\"\")","v":""},{"$f":"IFERROR(VLOOKUP($A20,[1]d!$A$1:$L$11,9,0),\"\")","v":""},{"$f":"IFERROR(VLOOKUP($A20,[1]d!$A$1:$L$11,10,0),\"\")","v":""},{"$f":"IFERROR(VLOOKUP($A20,[1]d!$A$1:$L$11,4,0),\"\")","v":""},{"$f":"IFERROR(VLOOKUP($A20,[1]d!$A$1:$L$12,4,0),\"\")","v":""}]
["d-5",{"$f":"IFERROR(VLOOKUP($A21,[1]d!$A$1:$L$11,2,0),\"\")","v":""},{"$f":"IFERROR(VLOOKUP($A21,[1]d!$A$1:$L$11,3,0),\"\")","v":""},{"$f":"IFERROR(VLOOKUP($A21,[1]d!$A$1:$L$11,4,0),\"\")","v":""},{"$f":"IFERROR(VLOOKUP($A21,[1]d!$A$1:$L$11,5,0),\"\")","v":""},{"$f":"IFERROR(VLOOKUP($A21,[1]d!$A$1:$L$11,6,0),\"\")","v":""},{"$f":"IFERROR(VLOOKUP($A21,[1]d!$A$1:$L$11,7,0),\"\")","v":""},{"$f":"IFERROR(VLOOKUP($A21,[1]d!$A$1:$L$11,8,0),\"\")","v":""},{"$f":"IFERROR(VLOOKUP($A21,[1]d!$A$1:$L$11,9,0),\"\")","v":""},{"$f":"IFERROR(VLOOKUP($A21,[1]d!$A$1:$L$11,10,0),\"\")","v":""},{"$f":"IFERROR(VLOOKUP($A21,[1]d!$A$1:$L$11,4,0),\"\")","v":""},{"$f":"IFERROR(VLOOKUP($A21,[1]d!$A$1:$L$12,4,0),\"\")","v":""}]
["d-6",{"$f":"IFERROR(VLOOKUP($A22,[1]d!$A$1:$L$11,2,0),\"\")","v":""},{"$f":"IFERROR(VLOOKUP($A22,[1]d!$A$1:$L$11,3,0),\"\")","v":""},{"$f":"IFERROR(VLOOKUP($A22,[1]d!$A$1:$L$11,4,0),\"\")","v":""},{"$f":"IFERROR(VLOOKUP($A22,[1]d!$A$1:$L$11,5,0),\"\")","v":""},{"$f":"IFERROR(VLOOKUP($A22,[1]d!$A$1:$L$11,6,0),\"\")","v":""},{"$f":"IFERROR(VLOOKUP($A22,[1]d!$A$1:$L$11,7,0),\"\")","v":""},{"$f":"IFERROR(VLOOKUP($A22,[1]d!$A$1:$L$11,8,0),\"\")","v":""},{"$f":"IFERROR(VLOOKUP($A22,[1]d!$A$1:$L$11,9,0),\"\")","v":""},{"$f":"IFERROR(VLOOKUP($A22,[1]d!$A$1:$L$11,10,0),\"\")","v":""},{"$f":"IFERROR(VLOOKUP($A22,[1]d!$A$1:$L$11,4,0),\"\")","v":""},{"$f":"IFERROR(VLOOKUP($A22,[1]d!$A$1:$L$12,4,0),\"\")","v":""}]
["d-7",{"$f":"IFERROR(VLOOKUP($A23,[1]d!$A$1:$L$11,2,0),\"\")","v":""},{"$f":"IFERROR(VLOOKUP($A23,[1]d!$A$1:$L$11,3,0),\"\")","v":""},{"$f":"IFERROR(VLOOKUP($A23,[1]d!$A$1:$L$11,4,0),\"\")","v":""},{"$f":"IFERROR(VLOOKUP($A23,[1]d!$A$1:$L$11,5,0),\"\")","v":""},{"$f":"IFERROR(VLOOKUP($A23,[1]d!$A$1:$L$11,6,0),\"\")","v":""},{"$f":"IFERROR(VLOOKUP($A23,[1]d!$A$1:$L$11,7,0),\"\")","v":""},{"$f":"IFERROR(VLOOKUP($A23,[1]d!$A$1:$L$11,8,0),\"\")","v":""},{"$f":"IFERROR(VLOOKUP($A23,[1]d!$A$1:$L$11,9,0),\"\")","v":""},{"$f":"IFERROR(VLOOKUP($A23,[1]d!$A$1:$L$11,10,0),\"\")","v":""},{"$f":"IFERROR(VLOOKUP($A23,[1]d!$A$1:$L$11,4,0),\"\")","v":""},{"$f":"IFERROR(VLOOKUP($A23,[1]d!$A$1:$L$12,4,0),\"\")","v":""}]
["d-8",{"$f":"IFERROR(VLOOKUP($A24,[1]d!$A$1:$L$11,2,0),\"\")","v":""},{"$f":"IFERROR(VLOOKUP($A24,[1]d!$A$1:$L$11,3,0),\"\")","v":""},{"$f":"IFERROR(VLOOKUP($A24,[1]d!$A$1:$L$11,4,0),\"\")","v":""},{"$f":"IFERROR(VLOOKUP($A24,[1]d!$A$1:$L$11,5,0),\"\")","v":""},{"$f":"IFERROR(VLOOKUP($A24,[1]d!$A$1:$L$11,6,0),\"\")","v":""},{"$f":"IFERROR(VLOOKUP($A24,[1]d!$A$1:$L$11,7,0),\"\")","v":""},{"$f":"IFERROR(VLOOKUP($A24,[1]d!$A$1:$L$11,8,0),\"\")","v":""},{"$f":"IFERROR(VLOOKUP($A24,[1]d!$A$1:$L$11,9,0),\"\")","v":""},{"$f":"IFERROR(VLOOKUP($A24,[1]d!$A$1:$L$11,10,0),\"\")","v":""},{"$f":"IFERROR(VLOOKUP($A24,[1]d!$A$1:$L$11,4,0),\"\")","v":""},{"$f":"IFERROR(VLOOKUP($A24,[1]d!$A$1:$L$12,4,0),\"\")","v":""}]
["d-9",{"$f":"IFERROR(VLOOKUP($A25,[1]d!$A$1:$L$11,2,0),\"\")","v":""},{"$f":"IFERROR(VLOOKUP($A25,[1]d!$A$1:$L$11,3,0),\"\")","v":""},{"$f":"IFERROR(VLOOKUP($A25,[1]d!$A$1:$L$11,4,0),\"\")","v":""},{"$f":"IFERROR(VLOOKUP($A25,[1]d!$A$1:$L$11,5,0),\"\")","v":""},{"$f":"IFERROR(VLOOKUP($A25,[1]d!$A$1:$L$11,6,0),\"\")","v":""},{"$f":"IFERROR(VLOOKUP($A25,[1]d!$A$1:$L$11,7,0),\"\")","v":""},{"$f":"IFERROR(VLOOKUP($A25,[1]d!$A$1:$L$11,8,0),\"\")","v":""},{"$f":"IFERROR(VLOOKUP($A25,[1]d!$A$1:$L$11,9,0),\"\")","v":""},{"$f":"IFERROR(VLOOKUP($A25,[1]d!$A$1:$L$11,10,0),\"\")","v":""},{"$f":"IFERROR(VLOOKUP($A25,[1]d!$A$1:$L$11,4,0),\"\")","v":""},{"$f":"IFERROR(VLOOKUP($A25,[1]d!$A$1:$L$12,4,0),\"\")","v":""}]
["d-10",{"$f":"IFERROR(VLOOKUP($A26,[1]d!$A$1:$L$11,2,0),\"\")","v":""},{"$f":"IFERROR(VLOOKUP($A26,[1]d!$A$1:$L$11,3,0),\"\")","v":""},{"$f":"IFERROR(VLOOKUP($A26,[1]d!$A$1:$L$11,4,0),\"\")","v":""},{"$f":"IFERROR(VLOOKUP($A26,[1]d!$A$1:$L$11,5,0),\"\")","v":""},{"$f":"IFERROR(VLOOKUP($A26,[1]d!$A$1:$L$11,6,0),\"\")","v":""},{"$f":"IFERROR(VLOOKUP($A26,[1]d!$A$1:$L$11,7,0),\"\")","v":""},{"$f":"IFERROR(VLOOKUP($A26,[1]d!$A$1:$L$11,8,0),\"\")","v":""},{"$f":"IFERROR(VLOOKUP($A26,[1]d!$A$1:$L$11,9,0),\"\")","v":""},{"$f":"IFERROR(VLOOKUP($A26,[1]d!$A$1:$L$11,10,0),\"\")","v":""},{"$f":"IFERROR(VLOOKUP($A26,[1]d!$A$1:$L$11,4,0),\"\")","v":""},{"$f":"IFERROR(VLOOKUP($A26,[1]d!$A$1:$L$12,4,0),\"\")","v":""}]

{"sheet":"Hoja2","index":1,"n_rows":0,"n_cols":0,"rows_kept":0,"cut":false,"hidden":false,"merged":[]}

{"sheet":"Hoja3","index":2,"n_rows":0,"n_cols":0,"rows_kept":0,"cut":false,"hidden":false,"merged":[]}